{"text_format":"1","workbook":"xlsx","n_sheets":6,"sheets":["Outputs Monthly","Timeliness Quarterly","CAP Count Summary","Action Plan Summary","DownloadBudgetData (2) Operatio","DownloadBudgetData Original"],"not_rendered":{"charts":0,"images":0,"macros":0,"external_links":0,"defined_names":4,"comments":0,"pivot_tables":0},"unopened":[],"bounds":{"document_bytes":16777216,"sheet_cells":100000,"rows_first":2000,"rows_last":500,"rows_between":2000,"halvings":0,"cell_chars":16384,"cell_head_chars":4096},"cells_cut":0,"cells_raw":0,"read":"whole","date_system":"1900"}

{"sheet":"Outputs Monthly","index":0,"n_rows":143,"n_cols":702,"rows_kept":143,"cut":false,"hidden":false,"merged":[[7,13,7,15],[5,3,5,4],[6,3,6,4],[7,3,7,4],[7,6,7,7],[7,10,7,11],[3,13,5,15]]}
[null,null,null,null,null,null,null,null,null,null,null,null,null,"Annual Financial Receipts"]
[null,"County Fiscal Year 2015-16",null,null,null,null,null,null,null,null,null,null,null,"Total Number of Financial Receipts for the Year:","Projected","Actual"]
[null,"Outputs Monthly Report Form for CCOC",null,null,null,null,null,null,null,null,null,null,null,null,{"$f":"LOOKUP(D8,'DownloadBudgetData (2) Operatio'!B2:B68,'DownloadBudgetData (2) Operatio'!AG2:AG68)","v":453037}]
[null,null,null,null,null,null,null,null,null,null,null,null,null,"Financial Receipts are totaled for the full fiscal year and entered here annually. This annual total is to be reported on the September submission."]
[]
[null,null,"Report for the Month of: ","Mar"]
[null,null,"Version #: ",2]
[null,null,"County: ","Brevard",null,"Contact:","Michelle Levar",null,null,"Telephone:","321-633-7782",null,"E-mail:","michelle.levar@brevardclerk.us"]
[]
[]
{"$rows_left_out":134}
{"sheet":"Timeliness Quarterly","index":1,"n_rows":83,"n_cols":702,"rows_kept":83,"cut":false,"hidden":false,"merged":[[5,6,5,8],[3,3,3,4],[3,6,3,7],[5,3,5,4],[4,6,4,7],[4,3,4,4],[19,3,21,3],[10,4,12,4],[13,4,15,4],[13,0,15,1],[10,0,12,1],[16,4,18,4],[16,0,18,1],[19,4,21,4],[9,1,9,2],[8,4,9,4],[8,3,9,3],[10,3,12,3],[13,3,15,3],[16,3,18,3],[19,0,21,1],[38,0,40,1],[29,0,31,1],[32,0,34,1],[35,0,37,1],[35,3,37,3],[22,1,22,2],[44,3,45,3],[44,4,45,4],[45,1,45,2],[29,4,31,4],[26,3,28,3],[26,4,28,4],[38,3,40,3],[38,4,40,4],[32,3,34,3],[32,4,34,4],[35,4,37,4],[29,3,31,3],[23,3,25,3],[23,4,25,4],[23,0,25,1],[26,0,28,1],[46,0,48,1],[46,3,48,3],[46,4,48,4],[49,0,51,1],[49,3,51,3],[49,4,51,4],[59,0,61,1],[59,3,61,3],[59,4,61,4],[52,0,54,1],[52,3,54,3],[52,4,54,4],[55,0,57,1],[55,3,57,3],[55,4,57,4],[58,1,58,2],[71,3,73,3],[71,4,73,4],[62,0,64,1],[62,3,64,3],[62,4,64,4],[65,0,67,1],[65,3,67,3],[65,4,67,4],[74,0,76,1],[74,3,76,3],[74,4,76,4],[68,0,70,1],[68,3,70,3],[68,4,70,4],[71,0,73,1],[8,10,8,11],[10,10,12,10],[10,11,12,11],[13,10,15,10],[13,11,15,11],[26,10,28,10],[26,11,28,11],[16,10,18,10],[16,11,18,11],[19,10,21,10],[19,11,21,11],[23,10,25,10],[23,11,25,11],[8,12,8,13],[10,12,12,12],[10,13,12,13],[13,12,15,12],[13,13,15,13],[16,12,18,12],[16,13,18,13],[19,12,21,12],[19,13,21,13],[8,14,8,15],[10,14,12,14],[10,15,12,15],[13,14,15,14],[13,15,15,15],[16,14,18,14],[16,15,18,15],[8,16,8,17],[10,16,12,16],[10,17,12,17],[13,16,15,16],[13,17,15,17],[16,16,18,16],[16,17,18,17],[23,12,25,12],[23,13,25,13],[23,14,25,14],[23,15,25,15],[23,16,25,16],[23,17,25,17],[19,14,21,14],[26,12,28,12],[26,13,28,13],[26,14,28,14],[26,15,28,15],[26,16,28,16],[26,17,28,17],[19,15,21,15],[19,16,21,16],[19,17,21,17],[29,10,31,10],[29,11,31,11],[29,12,31,12],[29,13,31,13],[29,14,31,14],[29,15,31,15],[29,16,31,16],[29,17,31,17],[32,10,34,10],[32,11,34,11],[32,12,34,12],[32,13,34,13],[32,14,34,14],[32,15,34,15],[32,16,34,16],[32,17,34,17],[35,10,37,10],[35,11,37,11],[35,12,37,12],[35,13,37,13],[35,14,37,14],[35,15,37,15],[35,16,37,16],[35,17,37,17],[38,10,40,10],[38,11,40,11],[38,12,40,12],[38,13,40,13],[38,14,40,14],[38,15,40,15],[38,16,40,16],[38,17,40,17],[44,10,44,11],[44,12,44,13],[44,14,44,15],[44,16,44,17],[46,10,48,10],[46,11,48,11],[46,12,48,12],[46,13,48,13],[46,14,48,14],[46,15,48,15],[46,16,48,16],[46,17,48,17],[49,10,51,10],[49,11,51,11],[49,12,51,12],[49,13,51,13],[49,14,51,14],[49,15,51,15],[49,16,51,16],[49,17,51,17],[52,10,54,10],[52,11,54,11],[52,12,54,12],[52,13,54,13],[52,14,54,14],[52,15,54,15],[52,16,54,16],[52,17,54,17],[55,10,57,10],[55,11,57,11],[55,12,57,12],[55,13,57,13],[55,14,57,14],[55,15,57,15],[55,16,57,16],[55,17,57,17],[59,10,61,10],[59,11,61,11],[59,12,61,12],[59,13,61,13],[59,14,61,14],[59,15,61,15],[59,16,61,16],[59,17,61,17],[62,10,64,10],[62,11,64,11],[62,12,64,12],[62,13,64,13],[62,14,64,14],[62,15,64,15],[62,16,64,16],[62,17,64,17],[65,10,67,10],[65,11,67,11],[65,12,67,12],[65,13,67,13],[65,14,67,14],[65,15,67,15],[65,16,67,16],[65,17,67,17],[74,10,76,10],[74,11,76,11],[74,12,76,12],[74,13,76,13],[74,14,76,14],[74,15,76,15],[74,16,76,16],[74,17,76,17],[68,10,70,10],[68,11,70,11],[68,12,70,12],[68,13,70,13],[68,14,70,14],[68,15,70,15],[68,16,70,16],[68,17,70,17],[71,10,73,10],[71,11,73,11],[71,12,73,12],[71,13,73,13],[71,14,73,14],[71,15,73,15],[71,16,73,16],[71,17,73,17]]}
[null,"County Fiscal Year 2015 - 2016"]
[null,"Timeliness Quarterly Report Form for CCOC"]
[]
[null,null,"Report Month of (Quarter Ending): ",{"$f":"'Outputs Monthly'!D6:E6","v":"Mar"},null,"Contact:",1936]
[null,null,"Version #: ",{"$f":"'Outputs Monthly'!D7:E7","v":2},null,"Telephone:","321-633-7782"]
[null,null,"County: ",{"$f":"'Outputs Monthly'!D8:E8","v":"Brevard"},null,"E-mail:","michelle.levar@brevardclerk.us"]
[]
["Timeliness Measures #1: Annual Projected % of new cases OPENED within X business days after initial documents are clocked in."]
[null,null,null,"Performance Measure Standard","# Of Business Days","10/1/15 - 12/31/15","1/1/16 - 3/31/16","4/1/16 - 6/30/16","7/1/16 - 9/30/16",null,{"$f":"F9","v":"10/1/15 - 12/31/15"},null,{"$f":"G9","v":"1/1/16 - 3/31/16"},null,{"$f":"H9","v":"4/1/16 - 6/30/16"},null,{"$f":"I9","v":"7/1/16 - 9/30/16"}]
["A","Criminal",null,null,null,"1st Quarter","2nd Quarter","3rd Quarter","4th Quarter","Year-to-Date","Reason Code","Comments / Actions to Improve","Reason Code","Comments / Actions to Improve","Reason Code","Comments / Actions to Improve","Reason Code","Comments / Actions to Improve",null,1]
{"$rows_left_out":74}
{"sheet":"CAP Count Summary","index":2,"n_rows":70,"n_cols":44,"rows_kept":70,"cut":false,"hidden":true,"merged":[[0,22,0,40]]}
["County","TIMELINESS STANDARD ONE (New Cases Opened)",null,null,null,null,null,null,null,null,null,null,null,null,null,null,null,null,null,null,null,null,"TIMELINESS STANDARD TWO (Docket Entries Processed)",null,null,null,null,null,null,null,null,null,null,null,null,null,null,null,null,null,null,null,null,"Sent Date"]
[null,"Circuit Criminal Reason","Improve Action","County Criminal Reason","Improve Action","Juvenile Delinquency Reason ","Improve Action","Criminal Traffic Reason ","Improve Action","Circuit Civil Reason","Improve Action","County Civil Reason","Improve Action","Civil Traffic Reason","Improve Action","Probate Reason","Improve Action","Family Reason","Improve Action","Juvenile Dependency Reason","Improve Action",null,"Circuit Criminal Reason","Improve Action","County Criminal Reason","Improve Action","Juvenile Delinquency Reason","Improve Action","Criminal Traffic Reason","Improve Action","Circuit Civil Reason","Improve Action","County Civil Reason","Improve Action","Civil Traffic Reason","Improve Action","Probate Reason","Improve Action","Family Reason","Improve Action","Juvenile Dependency Reason ","Improve Action"]
[]
["Alachua",null,null,null,null,null,null,null,null,null,null,null,null,null,null,null,null,null,null,null,null,null,null,null,null,null,null,null,null,null,null,null,null,null,null,null,null,null,null,null,null,null,null,20140220]
["Baker",null,null,null,null,null,null,null,null,null,null,null,null,null,null,null,null,null,null,null,null,null,null,null,null,null,null,null,null,null,null,null,null,null,null,null,null,null,null,null,null,null,null,20140207]
["Bay",null,null,null,null,null,null,null,null,null,null,null,null,null,null,null,null,null,null,null,null,null,null,null,null,null,null,null,null,null,null,null,null,null,null,null,null,null,null,null,null,null,null,20140218]
["Bradford",null,null,null,null,null,null,null,null,null,null,null,null,null,null,null,null,null,null,null,null,null,null,null,null,null,"Procedural","We are a small county with several Supreme Court death warrant appeals that had priority. ",null,null,null,null,null,null,null,null,null,null,null,null,"Procedural","We are a small county with several Supreme Court death warrant appeals that had priority. ",null,20140218]
["Brevard",null,null,null,null,null,null,null,null,null,null,null,null,null,null,null,null,null,null,null,null,null,null,null,null,null,null,null,null,null,null,null,null,null,null,null,null,null,null,null,null,null,null,20140218]
["Broward",null,null,null,null,null,null,null,null,null,null,null,null,null,null,"E-Filing","A high percentage of cases are rejected. When cases are resubmitted, the calculation for timeliness is based on the original file date.",null,null,null,null,null,null,null,null,null,null,null,null,null,null,null,null,null,null,null,null,null,null,null,"Systems","The division is still adjusting to new case maintenance system. E-filing should assist with improving the timeliness.",null,20140218]
["Calhoun",null,null,null,null,null,null,null,null,null,null,null,null,null,null,null,null,null,null,null,null,null,null,null,null,null,null,null,null,null,null,null,null,null,null,null,null,null,null,null,null,null,null,20140217]
{"$rows_left_out":61}
{"sheet":"Action Plan Summary","index":3,"n_rows":92,"n_cols":7,"rows_kept":92,"cut":false,"hidden":false,"merged":[[4,3,4,4],[5,3,5,4],[6,3,6,4],[9,0,12,0],[13,0,16,0],[17,0,20,0],[21,0,24,0],[25,0,28,0],[29,0,32,0],[33,0,36,0],[37,0,40,0],[41,0,44,0],[52,0,55,0],[56,0,59,0],[60,0,63,0],[45,0,48,0],[88,0,91,0],[64,0,67,0],[68,0,71,0],[72,0,75,0],[76,0,79,0],[80,0,83,0],[84,0,87,0]]}
[]
["County Fiscal Year 2015 - 2016"]
["Timeliness Quarterly Action Plan Form for CCOC"]
[]
[null,null,"Report Month of (Quarter Ending): ",{"$f":"'Outputs Monthly'!D6:E6","v":"Mar"},null,"Contact:"]
[null,null,"Version #: ",{"$f":"'Outputs Monthly'!D7:E7","v":2},null,"Telephone:"]
[null,null,"County: ",{"$f":"'Outputs Monthly'!D8:E8","v":"Brevard"},null,"E-mail:"]
[]
[" \nTimeliness Measeure # 1","Quarter","CCOC Standard",{"$f":"'Timeliness Quarterly'!E9","v":"# Of Business Days"},"Clerk Performance","Reason Code","Current Actions to Improve"]
["Circuit Criminal",{"$f":"'Timeliness Quarterly'!$F$9","v":"10/1/15 - 12/31/15"},{"$f":"'Timeliness Quarterly'!$D$11","v":0.8},{"$f":"'Timeliness Quarterly'!$E$11","v":2},{"$f":"IF(IFERROR('Timeliness Quarterly'!F$13,\"error\")=\"error\",\"\",IF('Timeliness Quarterly'!F$13<'Timeliness Quarterly'!$D$11,'Timeliness Quarterly'!F$13,\"\"))","v":""},{"$f":"IF(IFERROR('Timeliness Quarterly'!$K$11,\"error\")=\"error\",\"\",IF('Timeliness Quarterly'!$K$11=0,\"\",'Timeliness Quarterly'!$K$11))","v":""},{"$f":"IF(IFERROR('Timeliness Quarterly'!$L$11,\"error\")=\"error\",\"\",IF('Timeliness Quarterly'!$L$11=0,\"\",'Timeliness Quarterly'!$L$11))","v":""}]
{"$rows_left_out":83}
{"sheet":"DownloadBudgetData (2) Operatio","index":4,"n_rows":68,"n_cols":33,"rows_kept":68,"cut":false,"hidden":true,"merged":[]}
["FiscalYear","County","Outputs_NewCases_CrimCir","Outputs_NewCases_CrimCounty","Outputs_NewCases_CrimJuvDel","Outputs_NewCases_CrimTraf","Outputs_NewCases_CivCir","Outputs_NewCases_CivCounty","Outputs_NewCases_CivProbate","Outputs_NewCases_CivFamily","Outputs_NewCases_CivJuvDep","Outputs_NewCases_CivTraf","Outputs_Reopens_CrimCir","Outputs_Reopens_CrimCounty","Outputs_Reopens_CrimJuvDel","Outputs_Reopens_CrimTraf","Outputs_Reopens_CivCir","Outputs_Reopens_CivCounty","Outputs_Reopens_CivProbate","Outputs_Reopens_CivFamily","Outputs_Reopens_CivJuvDep","Outputs_Reopens_CivTraf","Outputs_NoticesOfAppeal_CrimCir","Outputs_NoticesOfAppeal_CrimCounty","Outputs_NoticesOfAppeal_CrimJuvDel","Outputs_NoticesOfAppeal_CrimTraf","Outputs_NoticesOfAppeal_CivCir","Outputs_NoticesOfAppeal_CivCounty","Outputs_NoticesOfAppeal_CivProbate","Outputs_NoticesOfAppeal_CivFamily","Outputs_NoticesOfAppeal_CivJuvDep","Outputs_NoticesOfAppeal_CivTraf","Outputs_FinReceipts"]
["2015-2016","Alachua",4550,5900,1220,4050,1750,4800,2700,2800,160,50000,1800,600,800,700,1300,2200,1450,4800,250,0,200,10,10,15,30,6,5,0,0,0,150000]
["2015-2016","Baker",571,741,121,479,153,266,193,418,64,4038,186,234,39,172,6,0,6,214,0,0,16,1,2,0,4,0,1,1,1,0,33140]
["2015-2016","Bay",5300,4200,1035,2100,1460,3081,1479,2787,315,32165,2562,1200,700,500,1000,840,40,2400,1600,0,185,10,5,2,30,6,4,10,12,1,75794]
["2015-2016","Bradford",700,625,130,675,250,380,125,375,16,8800,125,130,15,85,60,60,10,300,0,0,5,1,0,0,12,1,0,0,0,0,15000]
["2015-2016","Brevard",9200,10000,1800,7500,5600,7000,5000,7200,350,55000,8000,2100,2600,2100,6700,3600,2000,8700,500,0,500,25,3,30,100,20,10,35,25,15,453037]
["2015-2016","Broward",16650,23890,4190,28460,22920,70610,11030,24740,1070,314510,14640,2190,1940,1380,48680,23930,450,26810,5210,0,910,80,60,10,770,270,30,180,40,10,844380]
["2015-2016","Calhoun",210,150,30,125,75,120,55,225,10,1600,180,25,8,24,10,10,2,100,35,0,5,0,0,0,0,0,0,0,0,0,4700]
["2015-2016","Charlotte",2400,2500,650,2500,1800,1900,2400,2150,125,15500,1015,450,300,500,1075,400,475,580,30,0,60,8,1,1,50,3,3,0,3,3,53000]
["2015-2016","Citrus",1200,1800,300,900,1150,1600,1585,1800,220,5500,2500,900,260,600,1080,700,750,1800,1550,0,143,2,2,1,24,4,3,4,12,2,130000]
{"$rows_left_out":59}
{"sheet":"DownloadBudgetData Original","index":5,"n_rows":68,"n_cols":33,"rows_kept":68,"cut":false,"hidden":true,"merged":[]}
["FiscalYear","County","Outputs_NewCases_CrimCir","Outputs_NewCases_CrimCounty","Outputs_NewCases_CrimJuvDel","Outputs_NewCases_CrimTraf","Outputs_NewCases_CivCir","Outputs_NewCases_CivCounty","Outputs_NewCases_CivProbate","Outputs_NewCases_CivFamily","Outputs_NewCases_CivJuvDep","Outputs_NewCases_CivTraf","Outputs_Reopens_CrimCir","Outputs_Reopens_CrimCounty","Outputs_Reopens_CrimJuvDel","Outputs_Reopens_CrimTraf","Outputs_Reopens_CivCir","Outputs_Reopens_CivCounty","Outputs_Reopens_CivProbate","Outputs_Reopens_CivFamily","Outputs_Reopens_CivJuvDep","Outputs_Reopens_CivTraf","Outputs_NoticesOfAppeal_CrimCir","Outputs_NoticesOfAppeal_CrimCounty","Outputs_NoticesOfAppeal_CrimJuvDel","Outputs_NoticesOfAppeal_CrimTraf","Outputs_NoticesOfAppeal_CivCir","Outputs_NoticesOfAppeal_CivCounty","Outputs_NoticesOfAppeal_CivProbate","Outputs_NoticesOfAppeal_CivFamily","Outputs_NoticesOfAppeal_CivJuvDep","Outputs_NoticesOfAppeal_CivTraf","Outputs_FinReceipts"]
["2015-2016","Alachua",4550,5900,1220,4050,1750,4800,2700,2800,160,50000,1800,600,800,700,1300,2200,1450,4800,250,0,200,10,10,15,30,6,5,0,0,0,150000]
["2015-2016","Baker",571,741,121,479,153,266,193,418,64,4038,186,234,39,172,6,0,6,214,0,0,16,1,2,0,4,0,1,1,1,0,33140]
["2015-2016","Bay",5300,4200,1035,2100,1460,3081,1479,2787,315,32165,2562,1200,700,500,1000,840,40,2400,1600,0,185,10,5,2,30,6,4,10,12,1,75794]
["2015-2016","Bradford",700,650,120,600,250,325,115,350,16,8200,125,130,15,85,60,50,12,235,0,0,5,1,0,0,10,1,0,0,0,0,14000]
["2015-2016","Brevard",9200,10000,1800,7500,5600,7000,5000,7200,350,55000,8000,2100,2600,2100,6700,3600,2000,8700,500,0,500,25,3,30,100,20,10,35,25,15,453037]
["2015-2016","Broward",16920,26760,4680,32520,23880,70320,11280,25800,1080,359040,16680,1920,1770,1320,56160,26880,480,26040,4440,0,840,120,40,10,720,240,40,120,40,10,925000]
["2015-2016","Calhoun",210,150,30,125,75,120,55,225,10,1600,180,25,8,24,10,10,2,100,35,0,5,0,0,0,0,0,0,0,0,0,4700]
["2015-2016","Charlotte",2400,2500,650,2500,1800,1900,2400,2150,125,15500,1015,450,300,500,1075,400,475,580,30,0,60,8,1,1,50,3,3,0,3,3,53000]
["2015-2016","Citrus",1200,1800,300,900,1150,1600,1585,1800,220,5500,2500,900,260,600,1080,700,750,1800,1550,0,143,2,2,1,24,4,3,4,12,2,130000]
{"$rows_left_out":58}